Target
Alpha-1A adrenergic receptor
Ligand
BDBM50103888
Substrate
Meas. Tech.
ChEMBL_1436283 (CHEMBL3387783)
Ki
69±n/a nM
Citation
 Chen, JCampbell, APUrmi, KFWakelin, LPDenny, WAGriffith, RFinch, AM Human alpha1-adrenoceptor subtype selectivity of substituted homobivalent 4-aminoquinolines. Bioorg Med Chem 22:5910-6 (2014)  
Target
Name:
Alpha-1A adrenergic receptor
Synonyms:
ADA1A_HUMAN ADRA1C Alpha 1A-adrenoceptor Alpha adrenergic receptor 1a Alpha-adrenergic receptor 1c adrenergic Alpha1 | adrenergic Alpha1C
Type:
Cell-surface receptors
Mol. Mass.:
51511.67
Organism:
Homo sapiens (Human)
Description:
P35348
Residue:
466
  
Inhibitor
Name:
BDBM50103888
Synonyms:
CHEMBL3343978
Type:
Small organic molecule
Emp. Form.:
C22H22N4O2
Mol. Mass.:
374.4357
SMILES:
COc1ccc2c(NCCNc3ccnc4cc(OC)ccc34)ccnc2c1
: