Target
Alpha-1B adrenergic receptor
Ligand
BDBM50103892
Substrate
Meas. Tech.
ChEMBL_1436284 (CHEMBL3387784)
Ki
148±n/a nM
Citation
 Chen, JCampbell, APUrmi, KFWakelin, LPDenny, WAGriffith, RFinch, AM Human alpha1-adrenoceptor subtype selectivity of substituted homobivalent 4-aminoquinolines. Bioorg Med Chem 22:5910-6 (2014)  
Target
Name:
Alpha-1B adrenergic receptor
Synonyms:
ADA1B_HUMAN Adrenergic alpha1B Adrenergic receptor alpha Alpha 1B-adrenoreceptor | Alpha-1B adrenergic receptor
Type:
Enzyme
Mol. Mass.:
56862.13
Organism:
Homo sapiens (Human)
Description:
P35368
Residue:
520
  
Inhibitor
Name:
BDBM50103892
Synonyms:
CHEMBL3343981
Type:
Small organic molecule
Emp. Form.:
C27H32N4O2
Mol. Mass.:
444.5686
SMILES:
COc1ccc2nccc(NCCCCCCCNc3ccnc4ccc(OC)cc34)c2c1
: