Target
Protein mono-ADP-ribosyltransferase PARP3 [R100H]
Ligand
BDBM50104285
Substrate
Meas. Tech.
ChEMBL_1505400 (CHEMBL3595283)
IC50
91000±n/a nM
Citation
 Nkizinkiko, YSuneel Kumar, BVJeankumar, VUHaikarainen, TKoivunen, JMadhuri, CYogeeswari, PVenkannagari, HObaji, EPihlajaniemi, TSriram, DLehtiö, L Discovery of potent and selective nonplanar tankyrase inhibiting nicotinamide mimics. Bioorg Med Chem 23:4139-49 (2015)  
Target
Name:
Protein mono-ADP-ribosyltransferase PARP3 [R100H]
Synonyms:
(ARTD3 or PARP3) ADPRT3 Human diphtheria toxin-like ADP-ribosyltransferase (ARTD3 or PARP3) PARP3_HUMAN Poly [ADP-ribose] polymerase 3 (PARP-3) | Poly(ADP-ribose) polymerase-3 (ARTD3/PARP3)
Type:
PROTEIN
Mol. Mass.:
60071.85
Organism:
Homo sapiens (Human)
Description:
Q9Y6F1[R100H]
Residue:
533
  
Inhibitor
Name:
BDBM50104285
Synonyms:
CHEMBL3593716
Type:
Small organic molecule
Emp. Form.:
C13H20N4O
Mol. Mass.:
248.3241
SMILES:
CN1CCN(CC1)c1nc2CCCCc2c(=O)[nH]1
: