Target
Poly [ADP-ribose] polymerase tankyrase-2
Ligand
BDBM150781
Substrate
Meas. Tech.
ChEMBL_1505392 (CHEMBL3595275)
IC50
990±n/a nM
Citation
 Nkizinkiko, YSuneel Kumar, BVJeankumar, VUHaikarainen, TKoivunen, JMadhuri, CYogeeswari, PVenkannagari, HObaji, EPihlajaniemi, TSriram, DLehtiö, L Discovery of potent and selective nonplanar tankyrase inhibiting nicotinamide mimics. Bioorg Med Chem 23:4139-49 (2015)  
Target
Name:
Poly [ADP-ribose] polymerase tankyrase-2
Synonyms:
(ARTD6 or PARP5b) Poly [ADP-ribose] polymerase tankyrase-2 TNKL TNKS2_HUMAN Tankyrase 2 Tankyrase-2 Tankyrase-2 (TNKS2)
Type:
Enzyme
Mol. Mass.:
126937.16
Organism:
Homo sapiens (Human)
Description:
Q9H2K2
Residue:
1166
  
Inhibitor
Name:
BDBM150781
Synonyms:
2-(4-Methoxyphenyl)-2,3-dihydroquinazolin-4(1H)-one (1d)
Type:
Small organic molecule
Emp. Form.:
C15H14N2O2
Mol. Mass.:
254.2839
SMILES:
COc1ccc(cc1)C1NC(=O)c2ccccc2N1
: