Target
Cysteinyl leukotriene receptor 2
Ligand
BDBM50104836
Substrate
Meas. Tech.
ChEMBL_1506283 (CHEMBL3599261)
IC50
6.0±n/a nM
Citation
 Itadani, SYashiro, KAratani, YSekiguchi, TKinoshita, AMoriguchi, HOhta, NTakahashi, SIshida, ATajima, YHisaichi, KIma, MUeda, JEgashira, HSekioka, TKadode, MYonetomi, YNakao, TInoue, ANomura, HKitamine, TFujita, MNabe, TYamaura, YMatsumura, NImagawa, ANakayama, YTakeuchi, JOhmoto, K Discovery of Gemilukast (ONO-6950), a Dual CysLT1 and CysLT2 Antagonist As a Therapeutic Agent for Asthma. J Med Chem 58:6093-113 (2015)  
Target
Name:
Cysteinyl leukotriene receptor 2
Synonyms:
CLTR2_HUMAN CYSLT2R Cysteinyl leukotriene receptor Leukotriene Cysteinyl 2
Type:
Enzyme Catalytic Domain
Mol. Mass.:
39657.52
Organism:
Homo sapiens (Human)
Description:
Leukotriene Cysteinyl 2 CYSLTR2 HUMAN::Q9NS75
Residue:
346
  
Inhibitor
Name:
BDBM50104836
Synonyms:
CHEMBL3597522
Type:
Small organic molecule
Emp. Form.:
C32H33NO6
Mol. Mass.:
527.6075
SMILES:
OC(=O)CCCc1cn(CC(O)=O)c2c(\C=C\c3ccc(OCCCCOc4ccccc4)cc3)cccc12
: