Target
Cysteinyl leukotriene receptor 1
Ligand
BDBM50104911
Substrate
Meas. Tech.
ChEMBL_1506309 (CHEMBL3599287)
IC50
2.2±n/a nM
Citation
 Itadani, SYashiro, KAratani, YSekiguchi, TKinoshita, AMoriguchi, HOhta, NTakahashi, SIshida, ATajima, YHisaichi, KIma, MUeda, JEgashira, HSekioka, TKadode, MYonetomi, YNakao, TInoue, ANomura, HKitamine, TFujita, MNabe, TYamaura, YMatsumura, NImagawa, ANakayama, YTakeuchi, JOhmoto, K Discovery of Gemilukast (ONO-6950), a Dual CysLT1 and CysLT2 Antagonist As a Therapeutic Agent for Asthma. J Med Chem 58:6093-113 (2015)  
Target
Name:
Cysteinyl leukotriene receptor 1
Synonyms:
CLTR1_CAVPO | CYSLTR1
Type:
Enzyme Catalytic Domain
Mol. Mass.:
39007.58
Organism:
GUINEA PIG
Description:
Leukotriene D4 0 GUINEA PIG::Q2NNR5
Residue:
340
  
Inhibitor
Name:
BDBM50104911
Synonyms:
CHEMBL3597624
Type:
Small organic molecule
Emp. Form.:
C36H38ClNO5
Mol. Mass.:
600.144
SMILES:
Cc1c(CCCC(O)=O)c2cccc(C#Cc3ccc(OCCCCc4cccc(Cl)c4C)cc3)c2n1CCCC(O)=O
: