Target
Cysteinyl leukotriene receptor 1
Ligand
BDBM50023198
Substrate
Meas. Tech.
ChEMBL_1506470 (CHEMBL3599869)
IC50
4.3±n/a nM
Citation
 Itadani, SYashiro, KAratani, YSekiguchi, TKinoshita, AMoriguchi, HOhta, NTakahashi, SIshida, ATajima, YHisaichi, KIma, MUeda, JEgashira, HSekioka, TKadode, MYonetomi, YNakao, TInoue, ANomura, HKitamine, TFujita, MNabe, TYamaura, YMatsumura, NImagawa, ANakayama, YTakeuchi, JOhmoto, K Discovery of Gemilukast (ONO-6950), a Dual CysLT1 and CysLT2 Antagonist As a Therapeutic Agent for Asthma. J Med Chem 58:6093-113 (2015)  
Target
Name:
Cysteinyl leukotriene receptor 1
Synonyms:
CLTR1_HUMAN CYSLTR1 Cysteinyl leukotriene receptor HG55 LTD4 receptor | Leukotriene Cysteinyl 1
Type:
Enzyme Catalytic Domain
Mol. Mass.:
38565.16
Organism:
Homo sapiens (Human)
Description:
Leukotriene Cysteinyl 1 CYSLTR1 HUMAN::Q9Y271
Residue:
337
  
Inhibitor
Name:
BDBM50023198
Synonyms:
8-[4-(4-phenylbutyloxy)benzoyl]amino-2-(tetrazol-5-yl)-4-oxo-4H-1-benzopyran N-(4-oxo-2-(1H-tetrazol-5-yl)-4H-chromen-8-yl)-4-(4-phenylbutoxy)benzamide N-[4-Oxo-2-(1H-tetrazol-5-yl)-4H-chromen-8-yl]-4-(4-phenyl-butoxy)-benzamide (ONO-RS-411) ONO-1078 | PRANLUKAST
Type:
Small organic molecule
Emp. Form.:
C27H23N5O4
Mol. Mass.:
481.5026
SMILES:
O=C(Nc1cccc2c1oc(cc2=O)-c1nnn[nH]1)c1ccc(OCCCCc2ccccc2)cc1
: