Target
Histone deacetylase 1
Ligand
BDBM22449
Substrate
Meas. Tech.
ChEMBL_1506753 (CHEMBL3598912)
Ki
326±n/a nM
Citation
 Carrillo, AKGuiguemde, WAGuy, RK Evaluation of histone deacetylase inhibitors (HDACi) as therapeutic leads for human African trypanosomiasis (HAT). Bioorg Med Chem 23:5151-5 (2015)  
Target
Name:
Histone deacetylase 1
Synonyms:
Cereblon/Histone deacetylase 1 HDAC1 Histone deacetylase 1 (HDAC1) RPD3L1
Type:
Enzyme
Mol. Mass.:
55090.27
Organism:
Homo sapiens (Human)
Description:
Q13547
Residue:
482
  
Inhibitor
Name:
BDBM22449
Synonyms:
CHEMBL356769 Tubacin | US9249087, Tubastatin A
Type:
Small organic molecule
Emp. Form.:
C41H43N3O7S
Mol. Mass.:
721.861
SMILES:
OCc1ccc(cc1)[C@@H]1C[C@H](CSc2nc(c(o2)-c2ccccc2)-c2ccccc2)O[C@@H](O1)c1ccc(NC(=O)CCCCCCC(=O)NO)cc1
: