Target
Histone deacetylase 7
Ligand
BDBM22449
Substrate
Meas. Tech.
ChEMBL_1506759 (CHEMBL3598918)
Ki
5427±n/a nM
Citation
 Carrillo, AKGuiguemde, WAGuy, RK Evaluation of histone deacetylase inhibitors (HDACi) as therapeutic leads for human African trypanosomiasis (HAT). Bioorg Med Chem 23:5151-5 (2015)  
Target
Name:
Histone deacetylase 7
Synonyms:
HD7 HDAC7A Histone acetylase 7 (HDAC7) Human HDAC7
Type:
Chromatin regulator; hydrolase; repressor
Mol. Mass.:
102942.62
Organism:
Homo sapiens (Human)
Description:
Q8WUI4
Residue:
952
  
Inhibitor
Name:
BDBM22449
Synonyms:
CHEMBL356769 Tubacin | US9249087, Tubastatin A
Type:
Small organic molecule
Emp. Form.:
C41H43N3O7S
Mol. Mass.:
721.861
SMILES:
OCc1ccc(cc1)[C@@H]1C[C@H](CSc2nc(c(o2)-c2ccccc2)-c2ccccc2)O[C@@H](O1)c1ccc(NC(=O)CCCCCCC(=O)NO)cc1
: