Target
Nitric oxide synthase, inducible
Ligand
BDBM50105345
Substrate
Meas. Tech.
ChEMBL_1507410 (CHEMBL3599211)
IC50
4500±n/a nM
Citation
 Abdelazeem, AHKhan, SIWhite, SWSufka, KJMcCurdy, CR Design, synthesis and biological evaluation of bivalent benzoxazolone and benzothiazolone ligands as potential anti-inflammatory/analgesic agents. Bioorg Med Chem 23:3248-59 (2015)  
Target
Name:
Nitric oxide synthase, inducible
Synonyms:
Inducible NO synthase Inducible nitric oxide synthase (iNOS) MAC-NOS NOS type II Nitric Oxide Synthase, inducible Nos2
Type:
Enzyme
Mol. Mass.:
130595.79
Organism:
Mus musculus (mouse)
Description:
Recombinant enzyme overexpressed in E. coli.
Residue:
1144
  
Inhibitor
Name:
BDBM50105345
Synonyms:
CHEMBL3597259
Type:
Small organic molecule
Emp. Form.:
C27H34N4O4
Mol. Mass.:
478.5833
SMILES:
O=c1oc2ccccc2n1CCCCCCN1CCN(CCCn2c3ccccc3oc2=O)CC1
: