Target
Adenosylhomocysteinase
Ligand
BDBM50105902
Substrate
Meas. Tech.
ChEMBL_1507791 (CHEMBL3598548)
IC50
150±n/a nM
Citation
 Nakao, ASuzuki, HUeno, HIwasaki, HSetsuta, TKashima, ASunada, S Discovery and structural analyses of S-adenosyl-L-homocysteine hydrolase inhibitors based on non-adenosine analogs. Bioorg Med Chem 23:4952-69 (2015)  
Target
Name:
Adenosylhomocysteinase
Synonyms:
AHCY SAHH | SAHH_HUMAN
Type:
PROTEIN
Mol. Mass.:
47714.06
Organism:
Homo sapiens (Human)
Description:
ChEMBL_1507791
Residue:
432
  
Inhibitor
Name:
BDBM50105902
Synonyms:
CHEMBL3597823
Type:
Small organic molecule
Emp. Form.:
C37H44Cl2N4O5
Mol. Mass.:
695.675
SMILES:
CN(C1Cc2ccccc2C1)C(=O)CN(CC(=O)NCC1CCCCN1C(=O)OC(C)(C)C)c1cc(Cl)ccc1Oc1ccc(Cl)cc1
: