Target
Nuclear receptor ROR-gamma
Ligand
BDBM50105990
Substrate
Meas. Tech.
ChEMBL_1506250 (CHEMBL3599134)
EC50
7.6±n/a nM
Citation
 Wang, TBanerjee, DBohnert, TChao, JEnyedy, IFontenot, JGuertin, KJones, HLin, EYMarcotte, DTalreja, TVan Vloten, K Discovery of novel pyrazole-containing benzamides as potent ROR¿ inverse agonists. Bioorg Med Chem Lett 25:2985-90 (2015)  
Target
Name:
Nuclear receptor ROR-gamma
Synonyms:
NR1F3 Nuclear receptor ROR-gamma (RORC) RAR-related orphan receptor C (RORc) RORG RZRG Retinoid-related orphan receptor-gamma (RORc)
Type:
Enzyme Catalytic Domain
Mol. Mass.:
58218.40
Organism:
Homo sapiens (Human)
Description:
P51449
Residue:
518
  
Inhibitor
Name:
BDBM50105990
Synonyms:
CHEMBL3598057
Type:
Small organic molecule
Emp. Form.:
C29H31ClFN5O2
Mol. Mass.:
539.059
SMILES:
[2H]C([2H])([2H])N(C(=O)c1c(F)cccc1Cl)c1ccc(cc1N1CC2CC2C1)-c1cc(NC(=O)C2CC2)nn1C(C)C
: