Target
Nuclear receptor ROR-gamma
Ligand
BDBM50105930
Substrate
Meas. Tech.
ChEMBL_1506251 (CHEMBL3599135)
EC50
11±n/a nM
Citation
 Wang, TBanerjee, DBohnert, TChao, JEnyedy, IFontenot, JGuertin, KJones, HLin, EYMarcotte, DTalreja, TVan Vloten, K Discovery of novel pyrazole-containing benzamides as potent ROR¿ inverse agonists. Bioorg Med Chem Lett 25:2985-90 (2015)  
Target
Name:
Nuclear receptor ROR-gamma
Synonyms:
Nr1f3 Nuclear receptor subfamily 1 group F member 3 RORG_MOUSE Rorc TOR Thymus orphan receptor
Type:
PROTEIN
Mol. Mass.:
58133.31
Organism:
Mus musculus
Description:
ChEMBL_103664
Residue:
516
  
Inhibitor
Name:
BDBM50105930
Synonyms:
CHEMBL3598049
Type:
Small organic molecule
Emp. Form.:
C27H31ClFN5O2
Mol. Mass.:
515.037
SMILES:
[2H]C([2H])([2H])N(C(=O)c1c(F)cccc1Cl)c1ccc(cc1N1CCCCC1)-c1cc(NC(C)=O)nn1C(C)C
: