Target
Glucose-dependent insulinotropic receptor
Ligand
BDBM50106214
Substrate
Meas. Tech.
ChEMBL_1506408 (CHEMBL3599704)
EC50
776±n/a nM
Citation
 Han, SNarayanan, SKim, SHCalderon, IZhu, XKawasaki, AYue, DLehmann, JWong, ABuzard, DJSemple, GCarroll, CChu, ZLAl-Sharmma, HShu, HHTung, SFUnett, DJBehan, DPYoon, WHMorgan, MUsmani, KAChen, CSadeque, ALeonard, JNJones, RM Discovery of a novel trans-1,4-dioxycyclohexane GPR119 agonist series. Bioorg Med Chem Lett 25:3034-8 (2015)  
Target
Name:
Glucose-dependent insulinotropic receptor
Synonyms:
G-protein coupled receptor 119 (GPR119) GPR119 | Glucose-dependent insulinotropic receptor
Type:
Protein
Mol. Mass.:
36901.49
Organism:
Homo sapiens (Human)
Description:
Q8TDV5
Residue:
335
  
Inhibitor
Name:
BDBM50106214
Synonyms:
CHEMBL3598107
Type:
Small organic molecule
Emp. Form.:
C18H26F3N3O4S
Mol. Mass.:
437.477
SMILES:
CS(=O)(=O)c1cnc(O[C@H]2CC[C@@H](CC2)OC2CCN(CC(F)(F)F)CC2)cn1
: