Target
Glucose-dependent insulinotropic receptor
Ligand
BDBM50106127
Substrate
Meas. Tech.
ChEMBL_1506410 (CHEMBL3599706)
EC50
276±n/a nM
Citation
 Han, SNarayanan, SKim, SHCalderon, IZhu, XKawasaki, AYue, DLehmann, JWong, ABuzard, DJSemple, GCarroll, CChu, ZLAl-Sharmma, HShu, HHTung, SFUnett, DJBehan, DPYoon, WHMorgan, MUsmani, KAChen, CSadeque, ALeonard, JNJones, RM Discovery of a novel trans-1,4-dioxycyclohexane GPR119 agonist series. Bioorg Med Chem Lett 25:3034-8 (2015)  
Target
Name:
Glucose-dependent insulinotropic receptor
Synonyms:
G-protein coupled receptor 119 (GPR119) GPR119 | Glucose-dependent insulinotropic receptor
Type:
Protein
Mol. Mass.:
36901.49
Organism:
Homo sapiens (Human)
Description:
Q8TDV5
Residue:
335
  
Inhibitor
Name:
BDBM50106127
Synonyms:
CHEMBL3598115
Type:
Small organic molecule
Emp. Form.:
C22H32FN5O5S
Mol. Mass.:
497.583
SMILES:
CC(F)Cc1nc(CN2CCC(CC2)O[C@H]2CC[C@@H](CC2)Oc2cnc(cn2)S(C)(=O)=O)no1
: