Target
Nuclear receptor ROR-gamma
Ligand
BDBM50106285
Substrate
Meas. Tech.
ChEMBL_1506463 (CHEMBL3599862)
EC50
2.0±n/a nM
Citation
 Fauber, BPGobbi, ARobarge, KZhou, ABarnard, ACao, JDeng, YEidenschenk, CEverett, CGanguli, AHawkins, JJohnson, ARLa, HNorman, MSalmon, GSummerhill, SOuyang, WTang, WWong, H Discovery of imidazo[1,5-a]pyridines and -pyrimidines as potent and selective RORc inverse agonists. Bioorg Med Chem Lett 25:2907-12 (2015)  
Target
Name:
Nuclear receptor ROR-gamma
Synonyms:
NR1F3 Nuclear receptor ROR-gamma (RORC) RAR-related orphan receptor C (RORc) RORG RZRG Retinoid-related orphan receptor-gamma (RORc)
Type:
Enzyme Catalytic Domain
Mol. Mass.:
58218.40
Organism:
Homo sapiens (Human)
Description:
P51449
Residue:
518
  
Inhibitor
Name:
BDBM50106285
Synonyms:
CHEMBL3596279 | US9550771, Example 91
Type:
Small organic molecule
Emp. Form.:
C23H16ClN3O4
Mol. Mass.:
433.844
SMILES:
OC(=O)c1ccc(cc1O)-c1nc(C(=O)c2c(Cl)cccc2C2CC2)n2cccnc12
: