Target
Prostaglandin G/H synthase 2
Ligand
BDBM50106341
Substrate
Meas. Tech.
ChEMBL_1506586 (CHEMBL3598339)
IC50
1800±n/a nM
Citation
 Srinivas, VMohan, CDBaburajeev, CPRangappa, SJagadish, SFuchs, JESukhorukov, AYChandra, naMason, DJSharath Kumar, KSMadegowda, MBender, ABasappa, naRangappa, KS Synthesis and characterization of novel oxazines and demonstration that they specifically target cyclooxygenase 2. Bioorg Med Chem Lett 25:2931-6 (2015)  
Target
Name:
Prostaglandin G/H synthase 2
Synonyms:
COX2 Cyclooxygenase 2 (COX-2) Cyclooxygenase-2 (COX-2 AA) Cyclooxygenase-2 (COX-2) PGH2_HUMAN PHS II Prostaglandin E synthase/G/H synthase 2 Prostaglandin-endoperoxide synthase 2
Type:
Enzyme
Mol. Mass.:
69003.89
Organism:
Homo sapiens (Human)
Description:
Recombinant Cox-2 provided by Cayman (Cayman Chemical Co.,Ann Arbor, MI).
Residue:
604
  
Inhibitor
Name:
BDBM50106341
Synonyms:
CHEMBL3596282
Type:
Small organic molecule
Emp. Form.:
C26H33N3O2
Mol. Mass.:
419.5591
SMILES:
[H][C@@]12CCCC[C@]1([H])[C@H](C(CN1CCN(CC1)c1ccc(OC)cc1)=NO2)c1ccccc1
: