Target
Substance-P receptor
Ligand
BDBM50108643
Substrate
Meas. Tech.
ChEMBL_1506611 (CHEMBL3598468)
IC50
41±n/a nM
Citation
 Degnan, APTora, GOHan, YRajamani, RBertekap, RKrause, RDavis, CDHu, JMorgan, DTaylor, SJKrause, KLi, YWMattson, GCunningham, MATaber, MTLodge, NJBronson, JJGillman, KWMacor, JE Biaryls as potent, tunable dual neurokinin 1 receptor antagonists and serotonin transporter inhibitors. Bioorg Med Chem Lett 25:3039-43 (2015)  
Target
Name:
Substance-P receptor
Synonyms:
NK-1 receptor NK1 Receptor Neurokinin 1 receptor SPR Tac1r Tacr1
Type:
G Protein-Coupled Receptor (GPCR)
Mol. Mass.:
46371.54
Organism:
Rattus norvegicus (rat)
Description:
Competition binding assays were carried out using membrane preparations from transfected CHO cells that constitutively expressed the rat NK1 receptor.
Residue:
407
  
Inhibitor
Name:
BDBM50108643
Synonyms:
CHEMBL3596200
Type:
Small organic molecule
Emp. Form.:
C25H25F3N2O
Mol. Mass.:
426.474
SMILES:
FC(F)(F)c1cc(COCC2(CCNCC2)c2ccccc2)cc(c1)-c1ccccn1
: