Target
Urease
Ligand
BDBM50106910
Substrate
Meas. Tech.
ChEMBL_1508769 (CHEMBL3603108)
IC50
39760±n/a nM
Citation
 Rauf, AShahzad, SBajda, MYar, MAhmed, FHussain, NAkhtar, MNKhan, AJonczyk, J Design and synthesis of new barbituric- and thiobarbituric acid derivatives as potent urease inhibitors: Structure activity relationship and molecular modeling studies. Bioorg Med Chem 23:6049-58 (2015)  
Target
Name:
Urease
Synonyms:
UREA_CANEN | Urea amidohydrolase
Type:
Enzyme
Mol. Mass.:
90746.20
Organism:
Canavalia ensiformis (Jack bean) (Horse bean)
Description:
P07374
Residue:
840
  
Inhibitor
Name:
BDBM50106910
Synonyms:
CHEMBL3601763
Type:
Small organic molecule
Emp. Form.:
C12H8N4O6S
Mol. Mass.:
336.28
SMILES:
[#8]-[#6](=O)-c1cc(-[#7]\[#6]=[#6]-2/[#6](=O)-[#7]-[#6](=S)-[#7]-[#6]-2=O)ccc1-[#7+](-[#8-])=O
: