Target
Phosphatidylinositol 4-phosphate 5-kinase type-1 gamma
Ligand
BDBM50107255
Substrate
Meas. Tech.
ChEMBL_1508846 (CHEMBL3603395)
IC50
25119±n/a nM
Citation
 Raubo, PAndrews, DMMcKelvie, JCRobb, GRSmith, JMSwarbrick, MEWaring, MJ Discovery of potent, selective small molecule inhibitors ofa-subtype of type III phosphatidylinositol-4-kinase (PI4KIIIa). Bioorg Med Chem Lett 25:3189-93 (2015)  
Target
Name:
Phosphatidylinositol 4-phosphate 5-kinase type-1 gamma
Synonyms:
KIAA0589 PIP5K1-gamma PIP5KIgamma Phosphatidylinositol 4-phosphate 5-kinase type-1 gamma PtdIns(4)P-5-kinase 1 gamma
Type:
PROTEIN
Mol. Mass.:
73241.99
Organism:
Homo sapiens (Human)
Description:
ChEMBL_1508846
Residue:
668
  
Inhibitor
Name:
BDBM50107255
Synonyms:
CHEMBL3600783
Type:
Small organic molecule
Emp. Form.:
C23H27N3O2S
Mol. Mass.:
409.544
SMILES:
C[C@H](Nc1nc2ccc(cc2s1)-c1ccn(CC2CC2)c(=O)c1)C1CCOCC1
: