Target
Free fatty acid receptor 1
Ligand
BDBM50107292
Substrate
Meas. Tech.
ChEMBL_1508990 (CHEMBL3602370)
EC50
2650±n/a nM
Citation
 Zahanich, IKondratov, INaumchyk, VKheylik, YPlatonov, MZozulya, SKrasavin, M Phenoxymethyl 1,3-oxazoles and 1,2,4-oxadiazoles as potent and selective agonists of free fatty acid receptor 1 (GPR40). Bioorg Med Chem Lett 25:3105-11 (2015)  
Target
Name:
Free fatty acid receptor 1
Synonyms:
FFAR1 G-protein Coupled Receptor 40 | GPR40
Type:
G Protein-Coupled Receptor (GPCR)
Mol. Mass.:
31473.32
Organism:
Homo sapiens (Human)
Description:
O14842
Residue:
300
  
Inhibitor
Name:
BDBM50107292
Synonyms:
CHEMBL3601053
Type:
Small organic molecule
Emp. Form.:
C18H16N2O4
Mol. Mass.:
324.3306
SMILES:
OC(=O)CCc1ccc(OCc2noc(n2)-c2ccccc2)cc1
: