Target
Free fatty acid receptor 4
Ligand
BDBM50107305
Substrate
Meas. Tech.
ChEMBL_1508994 (CHEMBL3602374)
EC50
>10000±n/a nM
Citation
 Zahanich, IKondratov, INaumchyk, VKheylik, YPlatonov, MZozulya, SKrasavin, M Phenoxymethyl 1,3-oxazoles and 1,2,4-oxadiazoles as potent and selective agonists of free fatty acid receptor 1 (GPR40). Bioorg Med Chem Lett 25:3105-11 (2015)  
Target
Name:
Free fatty acid receptor 4
Synonyms:
FFAR4 G-protein coupled receptor 120 G-protein coupled receptor GT01 GPR120 O3FAR1 PGR4
Type:
PROTEIN
Mol. Mass.:
42256.91
Organism:
Homo sapiens (Human)
Description:
ChEMBL_1508994
Residue:
377
  
Inhibitor
Name:
BDBM50107305
Synonyms:
CHEMBL3601001
Type:
Small organic molecule
Emp. Form.:
C19H18N2O4
Mol. Mass.:
338.3572
SMILES:
Cc1ccc(cc1)-c1noc(COc2ccc(CCC(O)=O)cc2)n1
: