Target
Metabotropic glutamate receptor 5
Ligand
BDBM50107421
Substrate
Meas. Tech.
ChEMBL_1509288 (CHEMBL3603016)
IC50
56±n/a nM
Citation
 Yoshikawa, KOhyama, TTakahashi, ENumajiri, YKonno, MMoriyama, MTakemi, NKunita, KNishimura, KHayashi, R Identification of alpha-substituted acylamines as novel, potent, and orally active mGluR5 negative allosteric modulators. Bioorg Med Chem Lett 25:3135-41 (2015)  
Target
Name:
Metabotropic glutamate receptor 5
Synonyms:
GPRC1E GRM5_HUMAN metabotropic glutamate 5 | metabotropic glutamate 5a
Type:
Enzyme
Mol. Mass.:
132484.72
Organism:
Homo sapiens (Human)
Description:
Residue:
1212
  
Inhibitor
Name:
BDBM50107421
Synonyms:
CHEMBL3601913
Type:
Small organic molecule
Emp. Form.:
C18H18ClN5O2S
Mol. Mass.:
403.886
SMILES:
COC[C@H](NC(=O)c1nccs1)c1cnc(Nc2ccc(C)nc2)c(Cl)c1
: