Target
Metabotropic glutamate receptor 5
Ligand
BDBM50107539
Substrate
Meas. Tech.
ChEMBL_1509288 (CHEMBL3603016)
IC50
9.3±n/a nM
Citation
 Yoshikawa, KOhyama, TTakahashi, ENumajiri, YKonno, MMoriyama, MTakemi, NKunita, KNishimura, KHayashi, R Identification of alpha-substituted acylamines as novel, potent, and orally active mGluR5 negative allosteric modulators. Bioorg Med Chem Lett 25:3135-41 (2015)  
Target
Name:
Metabotropic glutamate receptor 5
Synonyms:
GPRC1E GRM5_HUMAN metabotropic glutamate 5 | metabotropic glutamate 5a
Type:
Enzyme
Mol. Mass.:
132484.72
Organism:
Homo sapiens (Human)
Description:
Residue:
1212
  
Inhibitor
Name:
BDBM50107539
Synonyms:
CHEMBL3601906
Type:
Small organic molecule
Emp. Form.:
C20H20ClN5OS
Mol. Mass.:
413.924
SMILES:
Cc1ccc(Nc2ncc(cc2Cl)[C@H](NC(=O)c2nccs2)C2CCC2)cn1
: