Target
Heat shock protein HSP 90-beta
Ligand
BDBM50107726
Substrate
Meas. Tech.
ChEMBL_1509295 (CHEMBL3603023)
IC50
99±n/a nM
Citation
 Sun, JLin, CQin, XDong, XTu, ZTang, FChen, CZhang, J Synthesis and biological evaluation of 3,5-disubstituted-4-alkynylisoxozales as a novel class of HSP90 inhibitors. Bioorg Med Chem Lett 25:3129-34 (2015)  
Target
Name:
Heat shock protein HSP 90-beta
Synonyms:
HS90B_HUMAN HSP 90 HSP90B HSPCB Heat shock protein HSP 90 (Hsp90)
Type:
Molecular Chaperone
Mol. Mass.:
83229.45
Organism:
Homo sapiens (Human)
Description:
P08238
Residue:
724
  
Inhibitor
Name:
BDBM50107726
Synonyms:
CHEMBL3600498
Type:
Small organic molecule
Emp. Form.:
C22H26N2O4
Mol. Mass.:
382.4528
SMILES:
CCNC(=O)c1noc(c1C#CC1CCCC1)-c1cc(C(C)C)c(O)cc1O
: