Target
Muscarinic acetylcholine receptor M1
Ligand
BDBM50107735
Substrate
Meas. Tech.
ChEMBL_1509302 (CHEMBL3603115)
IC50
8620±n/a nM
Citation
 Müller, SGHeckel, AKley, JTLehmann, TLustenberger, POost, TRoth, GJRudolf, KArndt, KLenter, MLotz, RRMaier, GMMarkert, MSchindler, MStenkamp, D Design, synthesis and evaluation of MCH receptor 1 antagonists--Part I: Optimization of HTS hits towards an in vivo efficacious tool compound BI 414. Bioorg Med Chem Lett 25:3264-9 (2015)  
Target
Name:
Muscarinic acetylcholine receptor M1
Synonyms:
ACM1_HUMAN Cholinergic receptor, muscarinic 1 | Cholinergic, muscarinic M1
Type:
Protein
Mol. Mass.:
51442.54
Organism:
Homo sapiens (Human)
Description:
P11229
Residue:
460
  
Inhibitor
Name:
BDBM50107735
Synonyms:
CHEMBL3600815
Type:
Small organic molecule
Emp. Form.:
C29H32FN3O2
Mol. Mass.:
473.5817
SMILES:
CC(=O)NC1CCN(Cc2ccc(CCNC(=O)c3ccc(cc3)-c3ccc(F)cc3)cc2)CC1
: