Target
Acetylcholinesterase
Ligand
BDBM50108607
Substrate
Meas. Tech.
ChEMBL_1507812 (CHEMBL3598676)
Kd
15400±n/a nM
Citation
 Valiveti, AKBhalerao, UMAcharya, JKarade, HNAcharya, BNRaviraju, GHalve, AKKaushik, MP Synthesis and in vitro kinetic evaluation of N-thiazolylacetamido monoquaternary pyridinium oximes as reactivators of sarin, O-ethylsarin and VX inhibited human acetylcholinesterase (hAChE). Bioorg Med Chem 23:4899-910 (2015)  
Target
Name:
Acetylcholinesterase
Synonyms:
ACES_HUMAN Acetylcholinesterase (AChE) | Acetylcholinesterase (human AChE)
Type:
Enzyme
Mol. Mass.:
67792.70
Organism:
Homo sapiens (Human)
Description:
P22303
Residue:
614
  
Inhibitor
Name:
BDBM50108607
Synonyms:
CHEMBL3597939
Type:
Small organic molecule
Emp. Form.:
C11H11ClN4O2S
Mol. Mass.:
298.749
SMILES:
[Cl-].O\N=C\c1cc[n+](CC(=O)Nc2nccs2)cc1
: