Target
Orexin receptor type 2
Ligand
BDBM50108623
Substrate
Meas. Tech.
ChEMBL_1507898 (CHEMBL3598909)
Ki
571±n/a nM
Citation
 Boss, CRoch, C Recent trends in orexin research--2010 to 2015. Bioorg Med Chem Lett 25:2875-87 (2015)  
Target
Name:
Orexin receptor type 2
Synonyms:
HCRTR2 OX2R_HUMAN Orexin receptor type 2 (OR-2) Orexin receptor type 2 (OX2R) Ox-2-R | Ox2-R
Type:
Protein
Mol. Mass.:
50710.53
Organism:
Homo sapiens (Human)
Description:
O43614
Residue:
444
  
Inhibitor
Name:
BDBM50108623
Synonyms:
CHEMBL3597965
Type:
Small organic molecule
Emp. Form.:
C22H19F3N6O
Mol. Mass.:
440.4211
SMILES:
FC(F)(F)c1cnc(N[C@@H]2CC3CCC2N3C(=O)c2ccccc2-c2ncccn2)cn1
: