Target
Orexin receptor type 2
Ligand
BDBM175203
Substrate
Meas. Tech.
ChEMBL_1507898 (CHEMBL3598909)
Ki
562±n/a nM
Citation
 Boss, CRoch, C Recent trends in orexin research--2010 to 2015. Bioorg Med Chem Lett 25:2875-87 (2015)  
Target
Name:
Orexin receptor type 2
Synonyms:
HCRTR2 OX2R_HUMAN Orexin receptor type 2 (OR-2) Orexin receptor type 2 (OX2R) Ox-2-R | Ox2-R
Type:
Protein
Mol. Mass.:
50710.53
Organism:
Homo sapiens (Human)
Description:
O43614
Residue:
444
  
Inhibitor
Name:
BDBM175203
Synonyms:
US9115117, 112 | US9611251, 112
Type:
Small organic molecule
Emp. Form.:
C22H22F3N5O2
Mol. Mass.:
445.4376
SMILES:
C[C@H]1[C@@H](CCCN1C(=O)c1ccc(C)cc1-n1nccn1)Oc1ccc(cn1)C(F)(F)F
: