Target
Thyrotropin-releasing hormone receptor
Ligand
BDBM50109035
Substrate
Meas. Tech.
ChEMBL_1508580 (CHEMBL3602663)
IC50
>50000±n/a nM
Citation
 Meena, CLThakur, ANandekar, PPSangamwar, ATSharma, SSJain, R Synthesis of CNS active thyrotropin-releasing hormone (TRH)-like peptides: Biological evaluation and effect on cognitive impairment induced by cerebral ischemia in mice. Bioorg Med Chem 23:5641-53 (2015)  
Target
Name:
Thyrotropin-releasing hormone receptor
Synonyms:
TRH-R2 | Thyrotropin-releasing hormone receptor 2
Type:
PROTEIN
Mol. Mass.:
27545.04
Organism:
Mus musculus
Description:
ChEMBL_109850
Residue:
251
  
Inhibitor
Name:
BDBM50109035
Synonyms:
CHEMBL3600450
Type:
Small organic molecule
Emp. Form.:
C20H32N6O3
Mol. Mass.:
404.5065
SMILES:
CC(C)c1nc(C[C@H](NC(=O)[C@H]2CCCCN2)C(=O)N2CCC[C@H]2C(N)=O)c[nH]1
: