Target
Genome polyprotein
Ligand
BDBM50109045
Substrate
Meas. Tech.
ChEMBL_1508912 (CHEMBL3602131)
IC50
2500±n/a nM
Citation
 Bastos Lima, ABehnam, MAEl Sherif, YNitsche, CVechi, SMKlein, CD Dual inhibitors of the dengue and West Nile virus NS2B-NS3 proteases: Synthesis, biological evaluation and docking studies of novel peptide-hybrids. Bioorg Med Chem 23:5748-55 (2015)  
Target
Name:
Genome polyprotein
Synonyms:
POLG_WNV | polyprotein precursor
Type:
PROTEIN
Mol. Mass.:
380170.63
Organism:
West Nile virus
Description:
ChEMBL_1438217
Residue:
3430
  
Inhibitor
Name:
BDBM50109045
Synonyms:
CHEMBL3601105
Type:
Small organic molecule
Emp. Form.:
C35H47N9O6S
Mol. Mass.:
721.869
SMILES:
CCC(C)N1C(=O)S\C(=C/c2ccc(cc2)C(=O)N[C@@H](CCCNC(N)=N)C(=O)N[C@@H](CCCCN)C(=O)N[C@H](C(N)=O)c2ccccc2)C1=O
: