Target
Polymerase acidic protein
Ligand
BDBM50109352
Substrate
Meas. Tech.
ChEMBL_1509125 (CHEMBL3602684)
IC50
63000±n/a nM
Citation
 Fudo, SYamamoto, NNukaga, MOdagiri, TTashiro, MNeya, SHoshino, T Structural and computational study on inhibitory compounds for endonuclease activity of influenza virus polymerase. Bioorg Med Chem 23:5466-75 (2015)  
Target
Name:
Polymerase acidic protein
Synonyms:
Hepatitis C virus polyprotein PA/PB1 Polymerase acidic protein | RNA-directed RNA polymerase subunit P2
Type:
PROTEIN
Mol. Mass.:
82573.84
Organism:
Hepatitis C virus
Description:
ChEMBL_64976
Residue:
716
  
Inhibitor
Name:
BDBM50109352
Synonyms:
CHEMBL2424783
Type:
Small organic molecule
Emp. Form.:
C14H10ClNO4
Mol. Mass.:
291.686
SMILES:
Oc1c(C=O)cc(Cc2ccccc2Cl)cc1[N+]([O-])=O
: