Target
Polymerase acidic protein
Ligand
BDBM105203
Substrate
Meas. Tech.
ChEMBL_1509131 (CHEMBL3602690)
IC50
11±n/a nM
Citation
 Fudo, SYamamoto, NNukaga, MOdagiri, TTashiro, MNeya, SHoshino, T Structural and computational study on inhibitory compounds for endonuclease activity of influenza virus polymerase. Bioorg Med Chem 23:5466-75 (2015)  
Target
Name:
Polymerase acidic protein
Synonyms:
Hepatitis C virus polyprotein PA/PB1 Polymerase acidic protein | RNA-directed RNA polymerase subunit P2
Type:
PROTEIN
Mol. Mass.:
82573.84
Organism:
Hepatitis C virus
Description:
ChEMBL_64976
Residue:
716
  
Inhibitor
Name:
BDBM105203
Synonyms:
6-(4-Fluorophenyl)-3-hydroxy-5-[4-(1H-1, 2, 3, 4-tetrazol-5-yl)phenyl]-1,2-dihydropyridin-2-one (Compound 7)
Type:
Small organic molecule
Emp. Form.:
C18H12FN5O2
Mol. Mass.:
349.3186
SMILES:
Oc1cc(-c2ccc(cc2)-c2nnn[nH]2)c([nH]c1=O)-c1ccc(F)cc1
: