Target
Tyrosine-protein kinase JAK3
Ligand
BDBM50109417
Substrate
Meas. Tech.
ChEMBL_1509383 (CHEMBL3603326)
IC50
6.2±n/a nM
Citation
 Tan, LAkahane, KMcNally, RReyskens, KMFicarro, SBLiu, SHerter-Sprie, GSKoyama, SPattison, MJLabella, KJohannessen, LAkbay, EAWong, KKFrank, DAMarto, JALook, TAArthur, JSEck, MJGray, NS Development of Selective Covalent Janus Kinase 3 Inhibitors. J Med Chem 58:6589-606 (2015)  
Target
Name:
Tyrosine-protein kinase JAK3
Synonyms:
JAK-3 JAK3_HUMAN Janus kinase 3 (JAK3) L-JAK | Leukocyte janus kinase
Type:
Protein
Mol. Mass.:
125111.08
Organism:
Homo sapiens (Human)
Description:
P52333
Residue:
1124
  
Inhibitor
Name:
BDBM50109417
Synonyms:
CHEMBL3601238
Type:
Small organic molecule
Emp. Form.:
C26H27ClF2N6O3
Mol. Mass.:
544.981
SMILES:
Fc1cc(Nc2ncc(Cl)c(NCc3cccc(NC(=O)C=C)c3)n2)cc(F)c1OCCN1CCOCC1
: