Target
Tyrosine-protein kinase JAK2
Ligand
BDBM50109531
Substrate
Meas. Tech.
ChEMBL_1509376 (CHEMBL3603319)
IC50
18±n/a nM
Citation
 Tan, LAkahane, KMcNally, RReyskens, KMFicarro, SBLiu, SHerter-Sprie, GSKoyama, SPattison, MJLabella, KJohannessen, LAkbay, EAWong, KKFrank, DAMarto, JALook, TAArthur, JSEck, MJGray, NS Development of Selective Covalent Janus Kinase 3 Inhibitors. J Med Chem 58:6589-606 (2015)  
Target
Name:
Tyrosine-protein kinase JAK2
Synonyms:
JAK-2 JAK2_HUMAN Janus kinase 2 (JAK2) | Janus kinase 2 (a protein tyrosine kinase)
Type:
Protein
Mol. Mass.:
130684.68
Organism:
Homo sapiens (Human)
Description:
O60674
Residue:
1132
  
Inhibitor
Name:
BDBM50109531
Synonyms:
CHEMBL3601231
Type:
Small organic molecule
Emp. Form.:
C24H25ClN6O2
Mol. Mass.:
464.947
SMILES:
Clc1cnc(Nc2ccc(cc2)N2CCOCC2)nc1NCc1cccc(NC(=O)C=C)c1
: