Target
Amine oxidase [flavin-containing] B
Ligand
BDBM50109538
Substrate
Meas. Tech.
ChEMBL_1509992 (CHEMBL3608045)
Ki
22±n/a nM
Citation
 Carradori, SSilvestri, R New Frontiers in Selective Human MAO-B Inhibitors. J Med Chem 58:6717-32 (2015)  
Target
Name:
Amine oxidase [flavin-containing] B
Synonyms:
AOFB_HUMAN MAOB Monoamine oxidase type B (MAO B) Monoamine oxidase type B (MAOB)
Type:
Protein
Mol. Mass.:
58768.76
Organism:
Homo sapiens (Human)
Description:
P27338
Residue:
520
  
Inhibitor
Name:
BDBM50109538
Synonyms:
CHEMBL3604126
Type:
Small organic molecule
Emp. Form.:
C21H30N3O2
Mol. Mass.:
356.4818
SMILES:
CN(Cc1ccc(CC(=O)NC2CC(C)(C)N([O])C(C)(C)C2)cc1)C#C
: