Target
P2X purinoceptor 7
Ligand
BDBM50110169
Substrate
Meas. Tech.
ChEMBL_1510174 (CHEMBL3606545)
IC50
1.9±n/a nM
Citation
 Rudolph, DAAlcazar, JAmeriks, MKAnton, ABAo, HBonaventure, PCarruthers, NIChrovian, CCDe Angelis, MLord, BRech, JCWang, QBhattacharya, AAndres, JILetavic, MA Novel methyl substituted 1-(5,6-dihydro-[1,2,4]triazolo[4,3-a]pyrazin-7(8H)-yl)methanones are P2X7 antagonists. Bioorg Med Chem Lett 25:3157-63 (2015)  
Target
Name:
P2X purinoceptor 7
Synonyms:
ATP receptor P2RX7_HUMAN P2X purinoceptor 7 (P2X7) P2Z receptor | Purinergic receptor
Type:
Protein
Mol. Mass.:
68602.85
Organism:
Homo sapiens (Human)
Description:
Q99572
Residue:
595
  
Inhibitor
Name:
BDBM50110169
Synonyms:
CHEMBL2218113
Type:
Small organic molecule
Emp. Form.:
C16H12Cl2N6O
Mol. Mass.:
375.212
SMILES:
Clc1cccc(C(=O)N2CCn3c(C2)nnc3-c2cnccn2)c1Cl
: