Target
Histone-lysine N-methyltransferase EZH2
Ligand
BDBM172038
Substrate
Meas. Tech.
ChEMBL_1511672 (CHEMBL3607425)
IC50
1.000000±n/a nM
Citation
 Gehling, VSVaswani, RGNasveschuk, CGDuplessis, MIyer, PBalasubramanian, SZhao, FGood, ACCampbell, RLee, CDakin, LACook, ASGagnon, AHarmange, JCAudia, JECummings, RTNormant, ETrojer, PAlbrecht, BK Discovery, design, and synthesis of indole-based EZH2 inhibitors. Bioorg Med Chem Lett 25:3644-9 (2015)  
Target
Name:
Histone-lysine N-methyltransferase EZH2
Synonyms:
ENX-1 EZH2_HUMAN Histone-lysine N-methyltransferase EZH2 Lysine N-methyltransferase 6
Type:
Protein
Mol. Mass.:
85367.84
Organism:
Homo sapiens (Human)
Description:
Q15910
Residue:
746
  
Inhibitor
Name:
BDBM172038
Synonyms:
US10155002, Compound 44 US11052093, Compound 143 US9090562, 143 US9394283, 1
Type:
Small organic molecule
Emp. Form.:
C34H44N4O4
Mol. Mass.:
572.7376
SMILES:
CCN(C1CCOCC1)c1cc(cc(C(=O)NCc2c(C)cc(C)[nH]c2=O)c1C)-c1ccc(CN2CCOCC2)cc1
: