Target
Breakpoint cluster region protein/Tyrosine-protein kinase ABL1
Ligand
BDBM50110429
Substrate
Meas. Tech.
ChEMBL_1511917 (CHEMBL3606398)
IC50
5.0±n/a nM
Citation
 Lu, XZhang, ZRen, XPan, XWang, DZhuang, XLuo, JYu, RDing, K Hybrid pyrimidine alkynyls inhibit the clinically resistance related Bcr-Abl(T315I) mutant. Bioorg Med Chem Lett 25:3458-63 (2015)  
Target
Name:
Breakpoint cluster region protein/Tyrosine-protein kinase ABL1
Synonyms:
Bcr-Abl Breakpoint cluster region protein /Tyrosine-protein kinase ABL | Tyrosine-protein kinase ABL1/Breakpoint cluster region protein
Type:
Enzyme
Mol. Mass.:
Description:
Components:
This complex has 2 components.
Component 1
Name:
Tyrosine-protein kinase ABL1
Synonyms:
ABL ABL1_HUMAN JTK7 Proto-oncogene tyrosine-protein kinase ABL1 Tyrosine-protein kinase ABL V-abl Abelson murine leukemia viral oncogene homolog 1 p150 | tyrosine-protein kinase ABL1 isoform a
Type:
Enzyme
Mol. Mass.:
122897.30
Organism:
Homo sapiens (Human)
Description:
P00519
Residue:
1130
  
Component 2
Name:
Breakpoint cluster region protein
Synonyms:
BCR BCR_HUMAN Breakpoint cluster region protein | D22S11
Type:
PROTEIN
Mol. Mass.:
142824.75
Organism:
Homo sapiens (Human)
Description:
ChEMBL_305348
Residue:
1271
  
Inhibitor
Name:
BDBM50110429
Synonyms:
CHEMBL3605774
Type:
Small organic molecule
Emp. Form.:
C28H23F3N6O
Mol. Mass.:
516.517
SMILES:
Cc1cn(cn1)-c1cc(NC(=O)c2ccc(C)c(c2)C#Cc2cnc(NC3CC3)nc2)cc(c1)C(F)(F)F
: