Target
Androgen receptor
Ligand
BDBM50110743
Substrate
Meas. Tech.
ChEMBL_1510385 (CHEMBL3607225)
Ki
1120±n/a nM
Citation
 Luz, JGCarson, MWCondon, BClawson, DPustilnik, AKohlman, DTBarr, RJBean, JSDill, MJSindelar, DKMaletic, MCoghlan, MJ Indole Glucocorticoid Receptor Antagonists Active in a Model of Dyslipidemia Act via a Unique Association with an Agonist Binding Site. J Med Chem 58:6607-18 (2015)  
Target
Name:
Androgen receptor
Synonyms:
ANDR_HUMAN Androgen Receptor Androgen receptor/Baculoviral IAP repeat-containing protein 2 Dihydrotestosterone receptor Nuclear receptor subfamily 3 group C member 4
Type:
Receptor
Mol. Mass.:
99185.27
Organism:
Homo sapiens (Human)
Description:
CHO cells were stably transfected with human AR gene.
Residue:
920
  
Inhibitor
Name:
BDBM50110743
Synonyms:
CHEMBL3605924
Type:
Small organic molecule
Emp. Form.:
C18H19FN2O4S
Mol. Mass.:
378.418
SMILES:
COc1cc(NS(C)(=O)=O)c2[nH]c(C)c(-c3cc(F)ccc3OC)c2c1
: