Target
Mineralocorticoid receptor
Ligand
BDBM50110750
Substrate
Meas. Tech.
ChEMBL_1510384 (CHEMBL3607224)
Ki
952±n/a nM
Citation
 Luz, JGCarson, MWCondon, BClawson, DPustilnik, AKohlman, DTBarr, RJBean, JSDill, MJSindelar, DKMaletic, MCoghlan, MJ Indole Glucocorticoid Receptor Antagonists Active in a Model of Dyslipidemia Act via a Unique Association with an Agonist Binding Site. J Med Chem 58:6607-18 (2015)  
Target
Name:
Mineralocorticoid receptor
Synonyms:
MCR MLR NR3C2 | Nuclear receptor subfamily 3 group C member 2
Type:
Enzyme
Mol. Mass.:
107076.42
Organism:
Homo sapiens (Human)
Description:
P08235
Residue:
984
  
Inhibitor
Name:
BDBM50110750
Synonyms:
CHEMBL3605925
Type:
Small organic molecule
Emp. Form.:
C9H10N2O2S
Mol. Mass.:
210.253
SMILES:
CS(=O)(=O)Nc1cccc2cc[nH]c12
: