Target
Eukaryotic translation initiation factor 4E
Ligand
BDBM50110894
Substrate
Meas. Tech.
ChEMBL_1511842 (CHEMBL3608168)
IC50
3260±n/a nM
Citation
 Ziemniak, MKowalska, JLukaszewicz, MZuberek, JWnek, KDarzynkiewicz, EJemielity, J Phosphate-modified analogues of m(7)GTP and m(7)Gppppm(7)G-Synthesis and biochemical properties. Bioorg Med Chem 23:5369-81 (2015)  
Target
Name:
Eukaryotic translation initiation factor 4E
Synonyms:
EIF4E | IF4E_RABIT
Type:
PROTEIN
Mol. Mass.:
25047.40
Organism:
Oryctolagus cuniculus
Description:
ChEMBL_1511842
Residue:
217
  
Inhibitor
Name:
BDBM50110894
Synonyms:
CHEMBL3604539
Type:
Small organic molecule
Emp. Form.:
C12H35BN9O12P3
Mol. Mass.:
601.192
SMILES:
[NH4+].[NH4+].[NH4+].[NH4+].[BH3-][P@@](=O)(OC[C@H]1O[C@H]([C@H](O)[C@@H]1O)n1c[n+](C)c2c([O-])nc(N)nc12)OP([O-])(=O)CP([O-])([O-])=O
: