Target
Ribosomal protein S6 kinase alpha-3
Ligand
BDBM50111394
Substrate
Meas. Tech.
ChEMBL_1509947 (CHEMBL3607765)
IC50
4.0±n/a nM
Citation
 Jain, RMathur, MLan, JCostales, AAtallah, GRamurthy, SSubramanian, SSetti, LFeucht, PWarne, BDoyle, LBasham, SJefferson, ABLindvall, MAppleton, BAShafer, CM Discovery of Potent and Selective RSK Inhibitors as Biological Probes. J Med Chem 58:6766-83 (2015)  
Target
Name:
Ribosomal protein S6 kinase alpha-3
Synonyms:
90 kDa ribosomal protein S6 kinase 3 ISPK1 MAP kinase-activated protein kinase 1b RPS6KA3 RSK2 Ribosomal protein S6 kinase Ribosomal protein S6 kinase alpha-3 (RSK2) S6K-alpha 3 p90 ribosomal s6 kinase (RSK2) p90RSK | pp90RSK2
Type:
Serine/threonine-protein kinase
Mol. Mass.:
83740.03
Organism:
Homo sapiens (Human)
Description:
The human RSK2 sequence differed from the Genbank entry NM_004586 at one residue, V45G. The protein was cloned and purified from baculovirus expression system.
Residue:
740
  
Inhibitor
Name:
BDBM50111394
Synonyms:
CHEMBL3604784
Type:
Small organic molecule
Emp. Form.:
C19H16F2N2O2
Mol. Mass.:
342.3393
SMILES:
NCCOc1cccc(c1)-c1ccncc1-c1cc(F)c(O)c(F)c1
: