Target
Cannabinoid receptor 2
Ligand
BDBM50248604
Substrate
Meas. Tech.
ChEMBL_1510270 (CHEMBL3606866)
EC50
153±n/a nM
Citation
 Presley, CSMustafa, SMAbidi, AHMoore, BM Synthesis and biological evaluation of (3',5'-dichloro-2,6-dihydroxy-biphenyl-4-yl)-aryl/alkyl-methanone selective CB2 inverse agonist. Bioorg Med Chem 23:5390-401 (2015)  
Target
Name:
Cannabinoid receptor 2
Synonyms:
CANNABINOID CB2 CB2 CB2B CNR2_HUMAN Cannabinoid CB2 receptor Cannabinoid receptor 2 (CB2R) | hCB2
Type:
G Protein-Coupled Receptor (GPCR)
Mol. Mass.:
39690.94
Organism:
Homo sapiens (Human)
Description:
P34972
Residue:
360
  
Inhibitor
Name:
BDBM50248604
Synonyms:
(3',5'-dichloro-2,6-dihydroxybiphenyl-4-yl)(phenyl)methanone US9139546, 28
Type:
Small organic molecule
Emp. Form.:
C19H12Cl2O3
Mol. Mass.:
359.203
SMILES:
Oc1cc(cc(O)c1-c1cc(Cl)cc(Cl)c1)C(=O)c1ccccc1
: