Target
Nuclear receptor ROR-gamma
Ligand
BDBM50111599
Substrate
Meas. Tech.
ChEMBL_1510459 (CHEMBL3607384)
IC50
251±n/a nM
Citation
 Wang, YYang, TLiu, QMa, YYang, LZhou, LXiang, ZCheng, ZLu, SOrband-Miller, LAZhang, WWu, QZhang, KLi, YXiang, JNElliott, JDLeung, SRen, FLin, X Discovery of N-(4-aryl-5-aryloxy-thiazol-2-yl)-amides as potent ROR¿t inverse agonists. Bioorg Med Chem 23:5293-302 (2015)  
Target
Name:
Nuclear receptor ROR-gamma
Synonyms:
Nr1f3 Nuclear receptor subfamily 1 group F member 3 RORG_MOUSE Rorc TOR Thymus orphan receptor
Type:
PROTEIN
Mol. Mass.:
58133.31
Organism:
Mus musculus
Description:
ChEMBL_103664
Residue:
516
  
Inhibitor
Name:
BDBM50111599
Synonyms:
CHEMBL3605083
Type:
Small organic molecule
Emp. Form.:
C26H24N2O5S2
Mol. Mass.:
508.609
SMILES:
CCS(=O)(=O)c1ccc(CC(=O)Nc2nc(c(Oc3ccccc3OC)s2)-c2ccccc2)cc1
: