Target
17-beta-hydroxysteroid dehydrogenase type 3
Ligand
BDBM91713
Substrate
Meas. Tech.
ChEMBL_1510493 (CHEMBL3607519)
IC50
169±n/a nM
Citation
 Djigoué, GBKenmogne, LCRoy, JMaltais, RPoirier, D Design, chemical synthesis and biological evaluation of 3-spiromorpholinone/3-spirocarbamate androsterone derivatives as inhibitors of 17ß-hydroxysteroid dehydrogenase type 3. Bioorg Med Chem 23:5433-51 (2015)  
Target
Name:
17-beta-hydroxysteroid dehydrogenase type 3
Synonyms:
DHB3_RAT Hsd17b3 | Testosterone 17-beta-dehydrogenase 3
Type:
PROTEIN
Mol. Mass.:
34235.73
Organism:
Rattus norvegicus
Description:
ChEMBL_1510493
Residue:
306
  
Inhibitor
Name:
BDBM91713
Synonyms:
Androst-4-en-3,17-dione, 2 Androstenedione
Type:
Small organic molecule
Emp. Form.:
C19H26O2
Mol. Mass.:
286.4085
SMILES:
C[C@]12CC[C@H]3[C@@H](CCC4=CC(=O)CC[C@]34C)[C@@H]1CCC2=O
: