Target
Amine oxidase [flavin-containing] A
Ligand
BDBM50111780
Substrate
Meas. Tech.
ChEMBL_1510679 (CHEMBL3606165)
IC50
22500±n/a nM
Citation
 Otto, RPenzis, RGaube, FAdolph, OFöhr, KJWarncke, PRobaa, DAppenroth, DFleck, CEnzensperger, CLehmann, JWinckler, T Evaluation of Homobivalent Carbolines as Designed Multiple Ligands for the Treatment of Neurodegenerative Disorders. J Med Chem 58:6710-5 (2015)  
Target
Name:
Amine oxidase [flavin-containing] A
Synonyms:
AOFA_HUMAN MAO-A Monoamine oxidase Monoamine oxidase type A (MAO A) Monoamine oxidase type A (MAOA)
Type:
Protein
Mol. Mass.:
59689.53
Organism:
Homo sapiens (Human)
Description:
P21397
Residue:
527
  
Inhibitor
Name:
BDBM50111780
Synonyms:
CHEMBL3605365
Type:
Small organic molecule
Emp. Form.:
C37H46I2N4
Mol. Mass.:
800.5969
SMILES:
[I-].[I-].CCC[n+]1ccc2n(CCCCCCCCCn3c4ccccc4c4c[n+](CCC)ccc34)c3ccccc3c2c1
: