Target
Cholinesterase
Ligand
BDBM50317179
Substrate
Meas. Tech.
ChEMBL_1510667 (CHEMBL3608118)
IC50
5.3±n/a nM
Citation
 Otto, RPenzis, RGaube, FAdolph, OFöhr, KJWarncke, PRobaa, DAppenroth, DFleck, CEnzensperger, CLehmann, JWinckler, T Evaluation of Homobivalent Carbolines as Designed Multiple Ligands for the Treatment of Neurodegenerative Disorders. J Med Chem 58:6710-5 (2015)  
Target
Name:
Cholinesterase
Synonyms:
BCHE CHLE_HORSE | Cholinesterase
Type:
Enzyme
Mol. Mass.:
65643.35
Organism:
Equus caballus (Horse)
Description:
P81908
Residue:
574
  
Inhibitor
Name:
BDBM50317179
Synonyms:
2-Methyl-9-[9-(2-methyl-beta-carboline-9-yl)nonyl]-beta-carboline-2-ium diiodide | CHEMBL1087458
Type:
Small organic molecule
Emp. Form.:
C33H38N4
Mol. Mass.:
490.6805
SMILES:
C[n+]1ccc2c(c1)n(CCCCCCCCCn1c3ccccc3c3cc[n+](C)cc13)c1ccccc21
: