Target
11-beta-hydroxysteroid dehydrogenase 1
Ligand
BDBM50112128
Substrate
Meas. Tech.
ChEMBL_1512869 (CHEMBL3611791)
IC50
>1000±n/a nM
Citation
 Hong, SPNam, KYShin, YJKim, KWAhn, SK Discovery of 11ß-hydroxysteroid dehydrogenase type 1 inhibitor. Bioorg Med Chem Lett 25:3501-6 (2015)  
Target
Name:
11-beta-hydroxysteroid dehydrogenase 1
Synonyms:
11-DH 11-beta-Hydroxysteroid Dehydrogenase 1 (11-beta-HSD1) 11-beta-hydroxysteroid dehydrogenase 1 (11HSD1) Corticosteroid 11-beta-dehydrogenase isozyme 1 (11-beta-HSD-1) Corticosteroid 11-beta-dehydrogenase isozyme 1 (11beta-HSD1) HSD11 HSD11L | SDR26C1
Type:
Enzyme
Mol. Mass.:
32409.16
Organism:
Homo sapiens (Human)
Description:
P28845
Residue:
292
  
Inhibitor
Name:
BDBM50112128
Synonyms:
CHEMBL3608408
Type:
Small organic molecule
Emp. Form.:
C22H29FN2O5S
Mol. Mass.:
452.539
SMILES:
CC(C)(NS(=O)(=O)c1ccccc1F)C(=O)N[C@H]1C2CC3CC1CC(CC(O)=O)(C3)C2
: