Target
11-beta-hydroxysteroid dehydrogenase 1
Ligand
BDBM50112145
Substrate
Meas. Tech.
ChEMBL_1512870 (CHEMBL3611792)
IC50
56±n/a nM
Citation
 Hong, SPNam, KYShin, YJKim, KWAhn, SK Discovery of 11ß-hydroxysteroid dehydrogenase type 1 inhibitor. Bioorg Med Chem Lett 25:3501-6 (2015)  
Target
Name:
11-beta-hydroxysteroid dehydrogenase 1
Synonyms:
11-DH 11-beta-Hydroxysteroid Dehydrogenase 1 (11-beta-HSD1) 11beta-HSD1A Corticosteroid 11-beta-dehydrogenase isozyme 1 (11-beta-HSD-1) Hsd11 | Hsd11b1
Type:
Enzyme
Mol. Mass.:
32369.70
Organism:
Mus musculus (mouse)
Description:
P50172
Residue:
292
  
Inhibitor
Name:
BDBM50112145
Synonyms:
CHEMBL3609873
Type:
Small organic molecule
Emp. Form.:
C25H37N3O4S
Mol. Mass.:
475.644
SMILES:
CC(C)(C)c1ccc(cc1)S(=O)(=O)NC(C)(C)C(=O)N[C@H]1C2CC3CC1CC(C3)(C2)C(N)=O
: